Fgo reroll odds

After having developped my Hexagon v65 DSP code with the help of the libnative intrinsics emulation library, I am now trying to port it on the SDK board Open-Q 845. fatal error: error in backend: Do not know how to split the result of this operator! hexagon-clang.exe: error: clang frontend command...I cannot use /dev/sda (the ssd) as a journal (which is an option in the GUI). i'm getting the following error: Disks are all raid 0 (HP410i controller, no passthrough sadly). i had no issue with ceph on 4.4 on the all hdd cluster.

Stata matrix size

If you work with Xcode code signing long enough you'll run into an error like this: /usr/bin/codesign failed with exit code 1. If you view the build results (Build->Build Results), and expand the error message (there is a little paragraph button on the right-hand side of the line) you may see something...Copied a copy of his engineering code from a friend, but the runtime reported the error of linker command failed with exit code 1 (use-vto see You can see if the path is right, if not, see if the folder is added to the project, and then see Library Search Path, if there is any error in setting.

Ib math applications and interpretation textbook pearson pdf

Dec 30, 2013 · You can execute the command in a subshell using os.system(). This will call the Standard C function system(). This function will return the exit status of the process or command. This method is considered as old and not recommended, but presented here for historical reasons only. Oct 07, 2020 · _posixsubprocess.c:16:20: fatal error: Python.h: No such file or directory #include "Python.h" ^ compilation terminated. error: command 'x86_64-linux-gnu-gcc' failed with exit status 1-----Failed building wheel for subprocess32 Running setup.py clean for subprocess32 Failed to build subprocess32 Installing collected packages: subprocess32 ... Not a directory (20) ERROR: configuring chroot error: error creating recovery partition: command failed with exit status: exit code: 23 ERROR: errored while installing system: error creating recovery partition: command failed with exit status: exit code: 23 INFO: Install error...

Cat c15 turbo for sale

We found that our node_modules folder only 289MB, but the previous image also includes the 311MB of the yarn cache folder. By using multi-stage builds, we also eliminated these cache folders too ... Jun 11, 2018 · Interfacing to your C++ Code via the JVM Pros Cons JNI • Skips the extra Python wrapper step – straight to JVM space (e.g., Spark ML Blas implementation using nettlib) • Clunky, difficult to maintain SWIG • Very powerful and mature • supports classes and nested types • Language-agnostic • Run over JNI • Very powerful and mature ... Alternative Fuels Data Center: Compressed Natural Gas Fueling Stations Science.gov Websites. infrastructure: time-fill and fast-fill.The main structural differences between the two systems are the amount fuel dispensed and the time it takes for CNG to be delivered.

Free math game websites for 1st grade

Exit code is 143 Container exited with a non-zero exit code 143 Killed by external signal. 16/09/01 18:11:41 ERROR YarnScheduler: Lost executor 1 on gsta31371.foo.com: Container marked as failed spark.yarn.executor.memoryOverhead 4096 spark.yarn.driver.memoryOverhead 8192.

Lack of work due to coronavirus pending resolution reddit

electron-react-boilerplate-issue-stacktrace. GitHub Gist: instantly share code, notes, and snippets. TASK ERROR: start failed: command '/usr/bin/kvm -id 100 -chardev 'socket,id=qmp,path E9:F0:74:81,netdev=net0,bus=pci.0,addr=0x12,id=net0,bootindex=300'' failed: exit code 1. (400). net1: hotplug problem - VM 1003 qmp command 'netdev_add' failed - Device 'tap' could not be...diabetes drinks products Ayurvedic treatment consists of the herbs and remedies that lower the blood sugar levels by reducing insulin resistance and correcting the insulin secretion.

Apple tv (fire tv apk)

A list of Yarn's error codes with detailed explanations. This usually occurs in only two cases: either the package never has been built before, or its previous build failed (returned a non-zero exit code). This error will be generated when Yarn detects that your project references a package that isn't listed...~ $ systemctl ● nmbd.service loaded failed failed ● smbd.service loaded failed failed. вот такое после обновления, как лечить? сен 10 07:28:55 sony systemd[1]: Starting Samba SMB/CIFS server... сен 10 07:28:56 sony systemd[1]: smbd.service: Control process exited, code=e...=1 сен 10...

How to change skyrim controls pc

After having developped my Hexagon v65 DSP code with the help of the libnative intrinsics emulation library, I am now trying to port it on the SDK board Open-Q 845. fatal error: error in backend: Do not know how to split the result of this operator! hexagon-clang.exe: error: clang frontend command...Code Name Description Comment; 0: OK: Indicates successful completion of the operation. 1: EOF: An attempt to read past the end-of-file was made; or, there are no more directory entries to return.

Pastor w f kumuyi 2020 prophecy

Oct 28, 2020 · So for fun I tried bumping my local and the package to 14.x and then pushed that as a PR - which passed on CircleCI.. It appears that 12.x is no longer supported? So will look at upgrading to 14.x. If they are already on the channel this doesn't kick them (needs chanop)" msgstr "" #: src/common/outbound.c:3508 #, fuzzy msgid "CHANOPT [-quiet] []" msgstr "SET [-quiet] []" #: src/common/outbound.c:3510 #, fuzzy msgid "CLEAR [ALL|HISTORY], Clears the current text window or command history" msgstr "CLEAR, uneko testu leihoa garbitzen du ... Following the Function Code is the Exception Code. The exception code gives an indication of the nature of the problem. The possible codes are shown in the table below. The exception code shown above 02 is an indication that coil #1186 is an illegal address in the slave. This coil has not been defined in the slave's modbus map.

Signs of negative energy in house in hindi

Oct 11, 2017 · "Exit code: 1" when running "yarn install" for BitBucket repo Stefan Monov Oct 11, 2017 I had a public github repo in the `dependencies` section of my `package.json`, and it worked fine. The Code of Federal Regulations is a codification of the general and permanent rules published in the Federal Register by the Executive departments and agencies of the Federal Government. The Code is divided into 50 titles which represent broad areas subject to Federal regulation.

Fsd test quizlet

Canu ERROR: File supplied on command line; use -s, -pacbio-raw, -pacbio-corrected, -nanopore-raw, or -nanopore-corrected. Hi everyone, I am trying to assemble a bacterial genome using PacBio reads and short illumina re... 질문 - yarn start error cmd에서... 만들때는 잘 됐었는데, 다시 들어가려니까 에러가 뜨네요. 'react-scripts'은(는) 내부 또는 외부 명령, 실행할 수 있는 프로그램, 또는. 배치 파일이 아닙니다. error Command failed with exit code 1.

Qvc pixel trees

问题:spark在yarn执行任务遇到如下的错误:ERROR YarnScheduler: Lost executor 17 on xxx: Container marked as failed Exit status: 134. Diagnostics: Exception from container-launch. 搜索Error,你会在打印的日志中看到Error的原因。 或者spark提交任务遇到错误执行不成功,而又找...

Fedex grade 10 salary

one is "/etc/host.conf: line 3: bad command `nospoof on'" which is weird as it appears on other scripts as well. However the update script is the one that Other scripts that display that notification run without issues. the other is: "FATAL: Failed to download updatenow.static from server: The system...If a container is no longer running, use the following command to find the status of the container: docker container ls -a This article explains possible reasons for the following exit code: "task: non-zero exit (137)" With exit code 137, you might also notice a status of Shutdown or the following failed message: Failed 42 hours ago Resolution An attempt was made to execute a null or nonexistent command. Check the logs for more details.

Az dcs warmline

Aug 05, 2019 · Unity ID. A Unity ID allows you to buy and/or subscribe to Unity products and services, shop in the Asset Store and participate in the Unity community. Requests that the service perform a health check. The RMAdmin tool will exit with a non-zero exit code if the check fails. -help [cmd] Displays help for the given command or all commands if none is specified. The code will work just fine, an error involving "linker" means that there are problems with the projects linker settings. I'm not sure exactly what the problem is, but you should try a tutorial for setting up a project in your IDE because there's probably something in the settings that needs to be changed.

Minecraft rpg magic mod

May 21, 2007 · We Were trying out the "HelloSequentialWorkflow"from msdn, wherein there was a call command to deploy the workflow using "PostBuildActions.bat" file. The Build Failed and we ... GraphQL error: Cannot read property 'code' of null when save page - wiki hot 1 CSS won't load from remote connection. hot 1 Testing beta using docker-compose fails hot 1